Target
Sterol regulatory element-binding protein 2
Ligand
BDBM629810
Substrate
Meas. Tech.
In Vitro Assay-SREBP-2
IC50
125±n/a nM
Citation
 Feula, ASalituro, FGStites, RE STEROIDAL COMPOSITIONS AND METHODS OF TREATING LIPOGENIC CANCERS US Patent  US20230340011 Publication Date 10/26/2023 
Target
Name:
Sterol regulatory element-binding protein 2
Synonyms:
BHLHD2 SREBF2 | SREBP2
Type:
PROTEIN
Mol. Mass.:
123713.87
Organism:
Homo sapiens (Human)
Description:
ChEMBL_765690
Residue:
1141
  
Inhibitor
Name:
BDBM629810
Synonyms:
US20230340011, Example 106.
Type:
Small organic molecule
Emp. Form.:
C31H51NO3
Mol. Mass.:
485.7415
SMILES:
CC[C@@]1(O)CCCN(C1)C(=O)CC[C@@H](C)[C@H]1CC[C@H]2[C@@H]3CC=C4C[C@@H](O)CC[C@]4(C)[C@H]3CC[C@]12C
: