Target
Gelatinase
Ligand
BDBM633985
Substrate
Meas. Tech.
Inhibition of Collagenase H Assay
IC50
372±n/a nM
Citation
 HOEKSTRA, WRYU, HCHINTHA, P SMALL MOLECULE INHIBITORS OF BACTERIAL TOXINS US Patent  US20230357139 Publication Date 11/9/2023 
Target
Name:
Gelatinase
Synonyms:
Coccolysin
Type:
Protein
Mol. Mass.:
55485.95
Organism:
Description:
Q833V7
Residue:
510
 
Inhibitor
Name:
BDBM633985
Synonyms:
US20230357139, Compound C
Type:
Small organic molecule
Emp. Form.:
C14H22N2O5S
Mol. Mass.:
330.4
SMILES:
CCOc1ccc(cc1)S(=O)(=O)N(CC(C)C)CC(=O)NO
: