Target
Gelatinase
Ligand
BDBM633989
Substrate
Meas. Tech.
Inhibition of Collagenase H Assay
IC50
443±n/a nM
Citation
 HOEKSTRA, WRYU, HCHINTHA, P SMALL MOLECULE INHIBITORS OF BACTERIAL TOXINS US Patent  US20230357139 Publication Date 11/9/2023 
Target
Name:
Gelatinase
Synonyms:
Coccolysin
Type:
Protein
Mol. Mass.:
55485.95
Organism:
Description:
Q833V7
Residue:
510
 
Inhibitor
Name:
BDBM633989
Synonyms:
US20230357139, Compound G
Type:
Small organic molecule
Emp. Form.:
C15H24N2O6S
Mol. Mass.:
360.426
SMILES:
COCCOc1ccc(cc1)S(=O)(=O)N(CC(C)C)CC(=O)NO
: