Target
Gelatinase
Ligand
BDBM634000
Substrate
Meas. Tech.
Inhibition of Collagenase H Assay
IC50
2419±n/a nM
Citation
 HOEKSTRA, WRYU, HCHINTHA, P SMALL MOLECULE INHIBITORS OF BACTERIAL TOXINS US Patent  US20230357139 Publication Date 11/9/2023 
Target
Name:
Gelatinase
Synonyms:
Coccolysin
Type:
Protein
Mol. Mass.:
55485.95
Organism:
Description:
Q833V7
Residue:
510
 
Inhibitor
Name:
BDBM634000
Synonyms:
US20230357139, Compound R
Type:
Small organic molecule
Emp. Form.:
C15H22N2O5S
Mol. Mass.:
342.411
SMILES:
CC(C)CN(CC(=O)NO)S(=O)(=O)c1ccc(OCC=C)cc1
: