Target
Gelatinase
Ligand
BDBM634003
Substrate
Meas. Tech.
Inhibition of Collagenase H Assay
IC50
8531±n/a nM
Citation
 HOEKSTRA, WRYU, HCHINTHA, P SMALL MOLECULE INHIBITORS OF BACTERIAL TOXINS US Patent  US20230357139 Publication Date 11/9/2023 
Target
Name:
Gelatinase
Synonyms:
Coccolysin
Type:
Protein
Mol. Mass.:
55485.95
Organism:
Description:
Q833V7
Residue:
510
 
Inhibitor
Name:
BDBM634003
Synonyms:
US20230357139, Compound U
Type:
Small organic molecule
Emp. Form.:
C12H18N2O5S
Mol. Mass.:
302.347
SMILES:
CCCN(CC(=O)NO)S(=O)(=O)c1ccc(OC)cc1
: