Target
Gelatinase
Ligand
BDBM634008
Substrate
Meas. Tech.
Inhibition of Collagenase H Assay
IC50
246±n/a nM
Citation
 HOEKSTRA, WRYU, HCHINTHA, P SMALL MOLECULE INHIBITORS OF BACTERIAL TOXINS US Patent  US20230357139 Publication Date 11/9/2023 
Target
Name:
Gelatinase
Synonyms:
Coccolysin
Type:
Protein
Mol. Mass.:
55485.95
Organism:
Description:
Q833V7
Residue:
510
 
Inhibitor
Name:
BDBM634008
Synonyms:
US20230357139, Compound Z
Type:
Small organic molecule
Emp. Form.:
C14H21FN2O5S
Mol. Mass.:
348.39
SMILES:
CC(C)CN(CC(=O)NO)S(=O)(=O)c1ccc(OCCF)cc1
: