Target
Gelatinase
Ligand
BDBM634009
Substrate
Meas. Tech.
Inhibition of Collagenase H Assay
IC50
1690±n/a nM
Citation
 HOEKSTRA, WRYU, HCHINTHA, P SMALL MOLECULE INHIBITORS OF BACTERIAL TOXINS US Patent  US20230357139 Publication Date 11/9/2023 
Target
Name:
Gelatinase
Synonyms:
Coccolysin
Type:
Protein
Mol. Mass.:
55485.95
Organism:
Description:
Q833V7
Residue:
510
 
Inhibitor
Name:
BDBM634009
Synonyms:
US20230357139, Compound AA
Type:
Small organic molecule
Emp. Form.:
C18H22N2O5S
Mol. Mass.:
378.443
SMILES:
CC(C)CN(CC(=O)NO)S(=O)(=O)c1ccc(Oc2ccccc2)cc1
: