Target
Fibroblast growth factor receptor 2
Ligand
BDBM643160
Substrate
Meas. Tech.
Biochemical Assay
IC50
4.30±n/a nM
Citation
 Zhang, DPeng, JCostanzo, MJGreen, MAGreco, MN PYRIDAZINE AND 1,2,4-TRIAZINE DERIVATIVES AS FGFR KINASE INHIBITORS US Patent  US20240002365 Publication Date 1/4/2024 
Target
Name:
Fibroblast growth factor receptor 2
Synonyms:
BEK FGFR-2 FGFR2 Fibroblast growth factor receptor 2 (FGFR2) KGFR Keratinocyte growth factor receptor VEGF-receptor 2 and Fibroblast growth factor receptor 2
Type:
Enzyme
Mol. Mass.:
92015.45
Organism:
Homo sapiens (Human)
Description:
P21802
Residue:
821
  
Inhibitor
Name:
BDBM643160
Synonyms:
N1-(3,5-Dimethoxyphenyl)-N2-isopropyl-N1-(3-(1-methyl-1H-pyrazol-4-yl)cinnolin-6-yl)ethane-1,2-diamine | US20240002365, Example 1
Type:
Small organic molecule
Emp. Form.:
C25H30N6O2
Mol. Mass.:
446.5447
SMILES:
COc1cc(OC)cc(c1)N(CCNC(C)C)c1ccc2nnc(cc2c1)-c1cnn(C)c1
: