Target
Fibroblast growth factor receptor 3
Ligand
BDBM643160
Substrate
Meas. Tech.
Biochemical Assay
IC50
7.60±n/a nM
Citation
 Zhang, DPeng, JCostanzo, MJGreen, MAGreco, MN PYRIDAZINE AND 1,2,4-TRIAZINE DERIVATIVES AS FGFR KINASE INHIBITORS US Patent  US20240002365 Publication Date 1/4/2024 
Target
Name:
Fibroblast growth factor receptor 3
Synonyms:
CD_antigen: CD333 FGFR3 Fibroblast growth factor receptor JTK4
Type:
Protein
Mol. Mass.:
87699.57
Organism:
Homo sapiens (Human)
Description:
P22607
Residue:
806
  
Inhibitor
Name:
BDBM643160
Synonyms:
N1-(3,5-Dimethoxyphenyl)-N2-isopropyl-N1-(3-(1-methyl-1H-pyrazol-4-yl)cinnolin-6-yl)ethane-1,2-diamine | US20240002365, Example 1
Type:
Small organic molecule
Emp. Form.:
C25H30N6O2
Mol. Mass.:
446.5447
SMILES:
COc1cc(OC)cc(c1)N(CCNC(C)C)c1ccc2nnc(cc2c1)-c1cnn(C)c1
: