Target
Fibroblast growth factor receptor 1
Ligand
BDBM643160
Substrate
Meas. Tech.
Biochemical Assay
IC50
9.50±n/a nM
Citation
 Zhang, DPeng, JCostanzo, MJGreen, MAGreco, MN PYRIDAZINE AND 1,2,4-TRIAZINE DERIVATIVES AS FGFR KINASE INHIBITORS US Patent  US20240002365 Publication Date 1/4/2024 
Target
Name:
Fibroblast growth factor receptor 1
Synonyms:
BFGFR Basic fibroblast growth factor receptor 1 (FGFR1) CEK FGFR-1 FGFR-1, (FL) FGFR1_HUMAN FLT2 Fibroblast growth factor receptor 1 (FGFR-1) Fms-like tyrosine kinase 2 N-sam bFGF-R | c-fgr
Type:
Receptor
Mol. Mass.:
91861.70
Organism:
Homo sapiens (Human)
Description:
P11362
Residue:
822
  
Inhibitor
Name:
BDBM643160
Synonyms:
N1-(3,5-Dimethoxyphenyl)-N2-isopropyl-N1-(3-(1-methyl-1H-pyrazol-4-yl)cinnolin-6-yl)ethane-1,2-diamine | US20240002365, Example 1
Type:
Small organic molecule
Emp. Form.:
C25H30N6O2
Mol. Mass.:
446.5447
SMILES:
COc1cc(OC)cc(c1)N(CCNC(C)C)c1ccc2nnc(cc2c1)-c1cnn(C)c1
: