Target
Prokineticin receptor 1
Ligand
BDBM250526
Substrate
Meas. Tech.
BIOLOGICAL ASSAY
IC50
530±n/a nM
Citation
 Carroll, CGoldby, ATeall, M Sulfonyl piperidine derivatives and their use for treating prokineticin mediated diseases US Patent  US10167273 Publication Date 1/1/2019 
Target
Name:
Prokineticin receptor 1
Synonyms:
G-protein coupled receptor 73 GPR73 PK-R1 PKR1_HUMAN | PROKR1
Type:
enzyme
Mol. Mass.:
44779.92
Organism:
Homo sapiens (Human)
Description:
Q8TCW9
Residue:
393
  
Inhibitor
Name:
BDBM250526
Synonyms:
US10167273, Example 5 US11512066, Example 5 | US9475795, 5
Type:
Small organic molecule
Emp. Form.:
C17H22ClN3O3S
Mol. Mass.:
383.893
SMILES:
Cc1nn(C)c(C)c1S(=O)(=O)N1CCC(CC1)Oc1ccc(Cl)cc1
: