Target
Acetylcholinesterase
Ligand
BDBM10441
Substrate
BDBM8959
Meas. Tech.
Enzyme Inhibition Assay
pH
8±n/a
Temperature
298.15±n/a K
Ki
47±n/a nM
Citation
 Gemma, SGabellieri, EHuleatt, PFattorusso, CBorriello, MCatalanotti, BButini, SDe Angelis, MNovellino, ENacci, VBelinskaya, TSaxena, ACampiani, G Discovery of huperzine A-tacrine hybrids as potent inhibitors of human cholinesterases targeting their midgorge recognition sites. J Med Chem 49:3421-5 (2006)  
Target
Name:
Acetylcholinesterase
Synonyms:
ACES_HUMAN Acetylcholinesterase (AChE) | Acetylcholinesterase (human AChE)
Type:
Enzyme
Mol. Mass.:
67792.70
Organism:
Homo sapiens (Human)
Description:
P22303
Residue:
614
  
Inhibitor
Name:
BDBM10441
Synonyms:
(+)-Huperzine A (-)-Huperzine A (1R,13E)-1-amino-13-ethylidene-11-methyl-6-azatricyclo[7.3.1.0^{2,7}]trideca-2(7),3,10-trien-5-one (5S,11E)-5-amino-11-ethylidene-7-methyl-5,6,9,10-tetrahydro-5,9-methanocycloocta[b]pyridin-2(1H)-one | Huperzine A
Type:
Small organic molecule
Emp. Form.:
C15H18N2O
Mol. Mass.:
242.3162
SMILES:
C\C=C1/C2Cc3[nH]c(=O)ccc3C1(N)CC(C)=C2
:
Substrate
Name:
BDBM8959
Synonyms:
(2-Mercaptoethyl)trimethylammonium iodide acetate Acetylthiocholine acetylthiocholine chloride | acetylthiocholine iodide
Type:
Small organic molecule
Emp. Form.:
C7H16NOS
Mol. Mass.:
162.272
SMILES:
CC(=O)SCC[N+](C)(C)C
: