Target
cAMP-specific 3',5'-cyclic phosphodiesterase 4D
Ligand
BDBM187126
Substrate
Meas. Tech.
Phosphodiesterase Assay
pH
7.4±n/a
Temperature
298.15±n/a K
IC50
0.9±0.0 nM
Comments
extracted
Citation
 Leblond, BChauvignac, CTaverne, TBeausoleil, ECasagrande, ADesire, LPando, MPDonello, JEYang, R Substituted 6,7-dialkoxy-3-isoquinolinol derivatives as inhibitors of phosphodiesterase 10 (PDE 10A) US Patent  US9670181 Publication Date 6/6/2017 
Target
Name:
cAMP-specific 3',5'-cyclic phosphodiesterase 4D
Synonyms:
3',5'-cyclic phosphodiesterase PDE43 PDE4D_HUMAN | Phosphodiesterase 4D
Type:
Protein
Mol. Mass.:
91092.69
Organism:
Homo sapiens (Human)
Description:
Q08499
Residue:
809
  
Inhibitor
Name:
BDBM187126
Synonyms:
US9670181, 6 4-(dibenzo[b,d]furan-2-ylmethyl)-1-ethyl-6,7-dimethoxyisoquinolin-3-ol
Type:
Small organic molecule
Emp. Form.:
C26H23NO4
Mol. Mass.:
413.4651
SMILES:
CCc1nc(O)c(Cc2ccc3oc4ccccc4c3c2)c2cc(OC)c(OC)cc12
: