Target
cAMP-specific 3',5'-cyclic phosphodiesterase 4D
Ligand
BDBM187172
Substrate
Meas. Tech.
Phosphodiesterase Assay
pH
7.4±n/a
Temperature
298.15±n/a K
IC50
280±0.0 nM
Comments
extracted
Citation
 Leblond, BChauvignac, CTaverne, TBeausoleil, ECasagrande, ADesire, LPando, MPDonello, JEYang, R Substituted 6,7-dialkoxy-3-isoquinolinol derivatives as inhibitors of phosphodiesterase 10 (PDE 10A) US Patent  US9670181 Publication Date 6/6/2017 
Target
Name:
cAMP-specific 3',5'-cyclic phosphodiesterase 4D
Synonyms:
3',5'-cyclic phosphodiesterase PDE43 PDE4D_HUMAN | Phosphodiesterase 4D
Type:
Protein
Mol. Mass.:
91092.69
Organism:
Homo sapiens (Human)
Description:
Q08499
Residue:
809
  
Inhibitor
Name:
BDBM187172
Synonyms:
US9670181, 51 1-isopropyl-6,7-dimethoxy-4-((6-methoxy-2-(2,2,2-trifluoroethylamino)quinolin-3-yl)methyl)isoquinolin-3-ol
Type:
Small organic molecule
Emp. Form.:
C27H28F3N3O4
Mol. Mass.:
515.5241
SMILES:
COc1ccc2nc(NCC(F)(F)F)c(Cc3c(O)nc(C(C)C)c4cc(OC)c(OC)cc34)cc2c1
: