Target
Protein farnesyltransferase subunit beta/geranylgeranyltransferase type-1 subunit alpha
Ligand
BDBM14423
Substrate
Ha-Ras-CVLS
Meas. Tech.
FTase Activity Assay
pH
7.5±n/a
Temperature
310.15±n/a K
IC50
0.5±n/a nM
Citation
 Li, QLi, TWoods, KWGu, WZCohen, JStoll, VSGalicia, THutchins, CFrost, DRosenberg, SHSham, HL Benzimidazolones and indoles as non-thiol farnesyltransferase inhibitors based on tipifarnib scaffold: synthesis and activity. Bioorg Med Chem Lett 15:2918-22 (2005)  
Target
Name:
Protein farnesyltransferase subunit beta/geranylgeranyltransferase type-1 subunit alpha
Synonyms:
Protein Farnesyltransferase (PFT) | Protein farnesyltransferase
Type:
Protein Complex
Mol. Mass.:
Description:
Purified bovine brain FTase.
Components:
This complex has 2 components.
Component 1
Name:
Protein farnesyltransferase/geranylgeranyltransferase type-1 subunit alpha
Synonyms:
CAAX farnesyltransferase alpha subunit FNTA_BOVIN GGTase-I-alpha Protein Farnesyltransferase (PFT) Chain A Protein farnesyltransferase/geranylgeranyltransferase type I alpha subunit Type I protein geranyl-geranyltransferase alpha subunit
Type:
Enzyme
Mol. Mass.:
43827.38
Organism:
Bos taurus (bovine)
Description:
The enzyme was purified from a bovine brain homogenate by sequential ammonium sulfate fractionation and affinity chromatography.
Residue:
375
  
Component 2
Name:
Protein farnesyltransferase subunit beta
Synonyms:
CAAX farnesyltransferase subunit beta FNTB_BOVIN Protein farnesyltransferase Protein farnesyltransferase subunit beta Ras proteins prenyltransferase subunit beta
Type:
Enzyme Subunit
Mol. Mass.:
48758.49
Organism:
Bos taurus (bovine)
Description:
Protein farnesyltransferase subunit beta
Residue:
437
  
Inhibitor
Name:
BDBM14423
Synonyms:
4-{[3-(3-ethoxyphenyl)-1-methyl-2-oxo-2,3-dihydro-1H-1,3-benzodiazol-5-yl](hydroxy)(1-methyl-1H-imidazol-5-yl)methyl}benzonitrile | benzimidazolone analog 2g
Type:
Small organic molecule
Emp. Form.:
C28H25N5O3
Mol. Mass.:
479.5298
SMILES:
CCOc1cccc(c1)-n1c2cc(ccc2n(C)c1=O)C(O)(c1cncn1C)c1ccc(cc1)C#N
:
Substrate
Name:
GTPase HRas
Synonyms:
GTPase HRas, N-terminally processed H-Ras-1 HRAS1 His6-Ha-Ras-CVLS Transforming protein p21 Wild-type Ha-Ras p21ras
Type:
Other Protein Type
Mol. Mass.:
21293.37
Organism:
Homo sapiens (Human)
Description:
P01112
Residue:
189