Target
Protein farnesyltransferase subunit beta/geranylgeranyltransferase type-1 subunit alpha
Ligand
BDBM14450
Substrate
Ha-Ras-CVLS
Meas. Tech.
FTase Activity Assay
pH
7.5±n/a
Temperature
310.15±n/a K
IC50
0.58±n/a nM
Citation
 Li, QWoods, KWWang, WLin, NHClaiborne, AGu, WZCohen, JStoll, VSHutchins, CFrost, DRosenberg, SHSham, HL Design, synthesis, and activity of achiral analogs of 2-quinolones and indoles as non-thiol farnesyltransferase inhibitors. Bioorg Med Chem Lett 15:2033-9 (2005)  
Target
Name:
Protein farnesyltransferase subunit beta/geranylgeranyltransferase type-1 subunit alpha
Synonyms:
Protein Farnesyltransferase (PFT) | Protein farnesyltransferase
Type:
Protein Complex
Mol. Mass.:
Description:
Purified bovine brain FTase.
Components:
This complex has 2 components.
Component 1
Name:
Protein farnesyltransferase/geranylgeranyltransferase type-1 subunit alpha
Synonyms:
CAAX farnesyltransferase alpha subunit FNTA_BOVIN GGTase-I-alpha Protein Farnesyltransferase (PFT) Chain A Protein farnesyltransferase/geranylgeranyltransferase type I alpha subunit Type I protein geranyl-geranyltransferase alpha subunit
Type:
Enzyme
Mol. Mass.:
43827.38
Organism:
Bos taurus (bovine)
Description:
The enzyme was purified from a bovine brain homogenate by sequential ammonium sulfate fractionation and affinity chromatography.
Residue:
375
  
Component 2
Name:
Protein farnesyltransferase subunit beta
Synonyms:
CAAX farnesyltransferase subunit beta FNTB_BOVIN Protein farnesyltransferase Protein farnesyltransferase subunit beta Ras proteins prenyltransferase subunit beta
Type:
Enzyme Subunit
Mol. Mass.:
48758.49
Organism:
Bos taurus (bovine)
Description:
Protein farnesyltransferase subunit beta
Residue:
437
  
Inhibitor
Name:
BDBM14450
Synonyms:
1-({1-[(4-cyanophenyl)methyl]-1H-imidazol-5-yl}methyl)-4-(naphthalen-1-yl)-1H-pyrrole-3-carbonitrile | pyrrole analog 4a
Type:
Small organic molecule
Emp. Form.:
C27H19N5
Mol. Mass.:
413.4733
SMILES:
N#Cc1cn(Cc2cncn2Cc2ccc(cc2)C#N)cc1-c1cccc2ccccc12
:
Substrate
Name:
GTPase HRas
Synonyms:
GTPase HRas, N-terminally processed H-Ras-1 HRAS1 His6-Ha-Ras-CVLS Transforming protein p21 Wild-type Ha-Ras p21ras
Type:
Other Protein Type
Mol. Mass.:
21293.37
Organism:
Homo sapiens (Human)
Description:
P01112
Residue:
189