Target
Beta-secretase 1
Ligand
BDBM15789
Substrate
BACE-1 Peptide Substrate
Meas. Tech.
BACE-1 Inhibition Assay
pH
5±n/a
Temperature
295.15±n/a K
IC50
>1000000±n/a nM
Citation
 Murray, CWCallaghan, OChessari, GCleasby, ACongreve, MFrederickson, MHartshorn, MJMcMenamin, RPatel, SWallis, N Application of fragment screening by X-ray crystallography to beta-secretase. J Med Chem 50:1116-23 (2007)  
Target
Name:
Beta-secretase 1
Synonyms:
ASP2 Aspartyl protease 2 BACE1 Beta-secretase (BACE) Beta-secretase 1 (BACE 1) Beta-secretase 1 (BACE1) Beta-site amyloid precursor protein cleaving enzyme 1 Memapsin-2 beta-Secretase (BACE-1) | beta-Secretase (BACE1)
Type:
Protein
Mol. Mass.:
55755.10
Organism:
Homo sapiens (Human)
Description:
P56817
Residue:
501
  
Inhibitor
Name:
BDBM15789
Synonyms:
(2S)-1-(2,5-dimethylphenoxy)-3-(morpholin-4-yl)propan-2-ol fragment 5
Type:
Small organic molecule
Emp. Form.:
C15H23NO3
Mol. Mass.:
265.348
SMILES:
Cc1ccc(C)c(OC[C@@H](O)CN2CCOCC2)c1
:
Substrate
Name:
BACE-1 Peptide Substrate
Synonyms:
Type:
Peptide
Mol. Mass.:
2721.34
Organism:
Description:
Residue:
23