Target
Coagulation factor X
Ligand
BDBM17298
Substrate
BDBM17296
Meas. Tech.
Determination of Inhibition Constants
pH
8±n/a
Temperature
310.15±n/a K
Ki
15±1 nM
Citation
 Nar, HBauer, MSchmid, AStassen, JMWienen, WPriepke, HWKauffmann, IKRies, UJHauel, NH Structural basis for inhibition promiscuity of dual specific thrombin and factor Xa blood coagulation inhibitors. Structure 9:29-37 (2001)  
Target
Name:
Coagulation factor X
Synonyms:
Activated coagulation factor X (FXa) Coagulation factor X precursor F10 Factor X heavy chain Factor Xa Stuart-Prower factor
Type:
Enzyme
Mol. Mass.:
54726.60
Organism:
Homo sapiens (Human)
Description:
Residue:
488
  
Inhibitor
Name:
BDBM17298
Synonyms:
4-[({1-methyl-5-[1-(pyrrolidin-1-ylcarbonyl)cyclopropyl]-1H-1,3-benzodiazol-2-yl}methyl)amino]benzene-1-carboximidamide | BIBM1015
Type:
Small organic molecule
Emp. Form.:
C24H28N6O
Mol. Mass.:
416.5187
SMILES:
Cn1c(CNc2ccc(cc2)C(N)=N)nc2cc(ccc12)C1(CC1)C(=O)N1CCCC1
:
Substrate
Name:
BDBM17296
Synonyms:
Not Specified
Type:
Emp. Form.:
Mol. Mass.:
SMILES:
: