Target
Serine protease 1
Ligand
BDBM17298
Substrate
BDBM17296
Meas. Tech.
Determination of Inhibition Constants
pH
8±n/a
Temperature
310.15±n/a K
Ki
102±10 nM
Citation
 Nar, HBauer, MSchmid, AStassen, JMWienen, WPriepke, HWKauffmann, IKRies, UJHauel, NH Structural basis for inhibition promiscuity of dual specific thrombin and factor Xa blood coagulation inhibitors. Structure 9:29-37 (2001)  
Target
Name:
Serine protease 1
Synonyms:
Beta-Trypsin PRSS1 TRY1 TRYP1 Trypsin I
Type:
Enzyme
Mol. Mass.:
25790.52
Organism:
Bos taurus (bovine)
Description:
P00760
Residue:
246
  
Inhibitor
Name:
BDBM17298
Synonyms:
4-[({1-methyl-5-[1-(pyrrolidin-1-ylcarbonyl)cyclopropyl]-1H-1,3-benzodiazol-2-yl}methyl)amino]benzene-1-carboximidamide | BIBM1015
Type:
Small organic molecule
Emp. Form.:
C24H28N6O
Mol. Mass.:
416.5187
SMILES:
Cn1c(CNc2ccc(cc2)C(N)=N)nc2cc(ccc12)C1(CC1)C(=O)N1CCCC1
:
Substrate
Name:
BDBM17296
Synonyms:
Not Specified
Type:
Emp. Form.:
Mol. Mass.:
SMILES:
: