Target
Cathepsin D
Ligand
BDBM228421
Substrate
Meas. Tech.
In Vitro Enzymatic
pH
3.5±n/a
IC50
33700±n/a nM
Comments
extracted
Citation
 Lewis, RTAllen, JRCheng, YChoquette, DEpstein, OGuzman-Perez, AHarrington, PEHua, ZHungate, RWHuman, JBJudd, TLiu, QLopez, PMinatti, AEOlivieri, PRomero, KRumfelt, SRzasa, RMSchenkel, LStellwagen, JWhite, RXue, QZheng, XMZhong, W Amino-dihydrothiazine and amino-dioxido dihydrothiazine compounds as beta-secretase antagonists and methods of use US Patent  US9556135 Publication Date 1/31/2017 
Target
Name:
Cathepsin D
Synonyms:
CATD_HUMAN CTSD Cathepsin D heavy chain Cathepsin D precursor
Type:
Enzyme
Mol. Mass.:
44551.72
Organism:
Homo sapiens (Human)
Description:
Human proCathepsin D (SwissProt accession number P07339) was expressed in Sf9 cells, purified, and autoactivated.
Residue:
412
  
Inhibitor
Name:
BDBM228421
Synonyms:
US9556135, 79
Type:
Small organic molecule
Emp. Form.:
C23H23FN2O2S2
Mol. Mass.:
442.569
SMILES:
CC1(C)C(N)=N[C@@](C)(CS1(=O)=O)c1cc(Sc2cccc3ccccc23)ccc1F
: