Target
Lysosomal acid glucosylceramidase
Ligand
BDBM18439
Substrate
BDBM18429
Meas. Tech.
GC Enzyme Assay
pH
5.9±n/a
Temperature
294.15±n/a K
Ki
102±n/a nM
IC50
168±n/a nM
Km
28000±n/a nM
Citation
 Zheng, WPadia, JUrban, DJJadhav, AGoker-Alpan, OSimeonov, AGoldin, EAuld, DLaMarca, MEInglese, JAustin, CPSidransky, E Three classes of glucocerebrosidase inhibitors identified by quantitative high-throughput screening are chaperone leads for Gaucher disease. Proc Natl Acad Sci U S A 104:13192-7 (2007)  
Target
Name:
Lysosomal acid glucosylceramidase
Synonyms:
Acid beta-glucosidase Beta-glucocerebrosidase D-glucosyl-N-acylsphingosine glucohydrolase GBA1 GC GLUC Glucosylceramidase (GBA) Glucosylceramidase precursor (Beta-glucocerebrosidase) (Acid beta-glucosidase) (D-glucosyl-N-acylsphingosine glucohydrolase) (Alglucerase) (Imiglucerase) beta-glucocerebrosidase (GCase)
Type:
Enzyme
Mol. Mass.:
59724.64
Organism:
Homo sapiens (Human)
Description:
The beta-Glu activity was measured with commercially available beta-glucocerebrosidase (Ceredase) as the enzyme source.
Residue:
536
  
Inhibitor
Name:
BDBM18439
Synonyms:
N-(5-methyl-1,2-oxazol-3-yl)-4-[(4-methylbenzene)sulfonamido]benzamide Sulfonamide analogue, 10
Type:
Small organic molecule
Emp. Form.:
C18H17N3O4S
Mol. Mass.:
371.41
SMILES:
Cc1cc(NC(=O)c2ccc(NS(=O)(=O)c3ccc(C)cc3)cc2)no1
:
Substrate
Name:
BDBM18429
Synonyms:
3-Phenoxazone 7-(beta-D-glucopyranoside) resorufin-beta-D-glucopyranoside
Type:
Small organic molecule
Emp. Form.:
C18H17NO8
Mol. Mass.:
375.3295
SMILES:
OC[C@H]1O[C@@H](Oc2ccc3nc4ccc(=O)cc4oc3c2)[C@H](O)[C@@H](O)[C@@H]1O
: