Target
Thymidine kinase
Ligand
BDBM21887
Substrate
BDBM21867
Meas. Tech.
Thymidine Kinase Inhibition Assay
pH
7.5±n/a
Temperature
310.15±n/a K
IC50
350±n/a nM
Km
1000±n/a nM
Citation
 Manikowski, AVerri, ALossani, AGebhardt, BMGambino, JFocher, FSpadari, SWright, GE Inhibition of herpes simplex virus thymidine kinases by 2-phenylamino-6-oxopurines and related compounds: structure-activity relationships and antiherpetic activity in vivo. J Med Chem 48:3919-29 (2005)  
Target
Name:
Thymidine kinase
Synonyms:
TK
Type:
Transferase
Mol. Mass.:
40915.49
Organism:
Human herpesvirus 1
Description:
O72346
Residue:
376
  
Inhibitor
Name:
BDBM21887
Synonyms:
2,9-disubstituted 6-oxopurine, 12k | 2-(phenylamino)-9-[4-(1,2,3,4-tetrahydroquinolin-1-yl)butyl]-6,9-dihydro-3H-purin-6-one dihydrochloride
Type:
Small organic molecule
Emp. Form.:
C24H26N6O
Mol. Mass.:
414.5028
SMILES:
O=c1[nH]c(Nc2ccccc2)nc2n(CCCCN3CCCc4ccccc34)cnc12
:
Substrate
Name:
BDBM21867
Synonyms:
[3H-methyl]TdR | [3H]thymidine
Type:
radiolabeled ligand
Emp. Form.:
Mol. Mass.:
SMILES:
: