Target
Thymidine kinase
Ligand
BDBM21882
Substrate
BDBM21867
Meas. Tech.
Thymidine Kinase Inhibition Assay
IC50
220±n/a nM
Citation
 Manikowski, AVerri, ALossani, AGebhardt, BMGambino, JFocher, FSpadari, SWright, GE Inhibition of herpes simplex virus thymidine kinases by 2-phenylamino-6-oxopurines and related compounds: structure-activity relationships and antiherpetic activity in vivo. J Med Chem 48:3919-29 (2005)  
Target
Name:
Thymidine kinase
Synonyms:
KITH_HHV23 | TK
Type:
Transferase
Mol. Mass.:
40467.78
Organism:
Human herpesvirus 2
Description:
Residue:
376
  
Inhibitor
Name:
BDBM21882
Synonyms:
2,9-disubstituted 6-oxopurine, 12f | 2-(phenylamino)-9-[4-(piperidin-1-yl)butyl]-6,9-dihydro-3H-purin-6-one dihydrochloride
Type:
Small organic molecule
Emp. Form.:
C20H26N6O
Mol. Mass.:
366.46
SMILES:
O=c1[nH]c(Nc2ccccc2)nc2n(CCCCN3CCCCC3)cnc12
:
Substrate
Name:
BDBM21867
Synonyms:
[3H-methyl]TdR | [3H]thymidine
Type:
radiolabeled ligand
Emp. Form.:
Mol. Mass.:
SMILES:
: