Target
Angiopoietin-1 receptor
Ligand
BDBM26366
Substrate
Her2 Peptide Substrate
Meas. Tech.
HTRF Kinase Inhibition Assay
IC50
123±n/a nM
Citation
 DiMauro, EFNewcomb, JNunes, JJBemis, JEBoucher, CChai, LChaffee, SCDeak, HLEpstein, LFFaust, TGallant, PGore, AGu, YHenkle, BHsieh, FHuang, XKim, JLLee, JHMartin, MWMcGowan, DCMetz, DMohn, DMorgenstern, KAOliveira-dos-Santos, APatel, VFPowers, DRose, PESchneider, STomlinson, SATudor, YYTurci, SMWelcher, AAZhao, HZhu, LZhu, X Structure-guided design of aminopyrimidine amides as potent, selective inhibitors of lymphocyte specific kinase: synthesis, structure-activity relationships, and inhibition of in vivo T cell activation. J Med Chem 51:1681-94 (2008)  
Target
Name:
Angiopoietin-1 receptor
Synonyms:
TEK TIE2_HUMAN Tyrosine-protein kinase receptor (TIE-2) Tyrosine-protein kinase receptor TEK (p140 TEK) Tyrosine-protein kinase receptor TIE2/TEK VMCM1 p140 TEK
Type:
Enzyme
Mol. Mass.:
125835.70
Organism:
Homo sapiens (Human)
Description:
Q02763
Residue:
1124
  
Inhibitor
Name:
BDBM26366
Synonyms:
4-methyl-3-N-(2-{[4-(4-methylpiperazin-1-yl)phenyl]amino}pyrimidin-5-yl)-1-N-[3-(trifluoromethyl)phenyl]benzene-1,3-dicarboxamide | Aminopyrimidine amide, 10b
Type:
Small organic molecule
Emp. Form.:
C31H30F3N7O2
Mol. Mass.:
589.6108
SMILES:
CN1CCN(CC1)c1ccc(Nc2ncc(NC(=O)c3cc(ccc3C)C(=O)Nc3cccc(c3)C(F)(F)F)cn2)cc1
:
Substrate
Name:
Her2 Peptide Substrate
Synonyms:
Biotinylated Her2 Peptide Substrate | biotinylated long chain peptide
Type:
Peptide
Mol. Mass.:
2278.65
Organism:
Description:
Residue:
20