Target
Mitogen-activated protein kinase kinase kinase 8
Ligand
BDBM28034
Substrate
biotin-MEK1-peptide
Meas. Tech.
COT HTRF Assay
pH
7.5±n/a
Temperature
295.15±n/a K
IC50
140±n/a nM
Citation
 Cusack, KAllen, HBischoff, AClabbers, ADixon, RFix-Stenzel, SFriedman, MGaumont, YGeorge, DGordon, TGrongsaard, PJanssen, BJia, YMoskey, MQuinn, CSalmeron, AThomas, CWallace, GWishart, NYu, Z Identification of a selective thieno[2,3-c]pyridine inhibitor of COT kinase and TNF-alpha production. Bioorg Med Chem Lett 19:1722-5 (2009)  
Target
Name:
Mitogen-activated protein kinase kinase kinase 8
Synonyms:
C-COT COT proto-oncogene serine/threonine-protein kinase ESTF MAP3K8 Tumor Progression Loci-2 Kinase (COT) | Tumor progression locus 2
Type:
Serine/threonine-protein kinase
Mol. Mass.:
52916.89
Organism:
Homo sapiens (Human)
Description:
P41279
Residue:
467
  
Inhibitor
Name:
BDBM28034
Synonyms:
4-[(4-phenylphenyl)amino]thieno[2,3-c]pyridine-2-carboxylic acid | thieno[2,3-c]pyridine, 3a
Type:
Small organic molecule
Emp. Form.:
C20H14N2O2S
Mol. Mass.:
346.402
SMILES:
OC(=O)c1cc2c(Nc3ccc(cc3)-c3ccccc3)cncc2s1
:
Substrate
Name:
biotin-MEK1-peptide
Synonyms:
Type:
Peptide
Mol. Mass.:
2380.63
Organism:
Description:
Residue:
24