Target
Macrophage metalloelastase
Ligand
BDBM29021
Substrate
BDBM10852
Meas. Tech.
Dissociation Constants (KD) Measurements
pH
7.2±n/a
Temperature
298.15±n/a K
Kd
>10000000±n/a nM
Citation
 Mannino, CNievo, MMachetti, FPapakyriakou, ACalderone, VFragai, MGuarna, A Synthesis of bicyclic molecular scaffolds (BTAa): an investigation towards new selective MMP-12 inhibitors. Bioorg Med Chem 14:7392-403 (2006)  
Target
Name:
Macrophage metalloelastase
Synonyms:
HME MMP12_HUMAN Matrix metalloproteinase-12 (MMP 12) Matrix metalloproteinase-12 (MMP12) | Matrix metalloproteinases 12 (MMP-12)
Type:
Enzyme
Mol. Mass.:
54012.99
Organism:
Homo sapiens (Human)
Description:
P39900
Residue:
470
  
Inhibitor
Name:
BDBM29021
Synonyms:
(1R,5S,7R)-3-benzyl-N-hydroxy-2-oxo-6,8-dioxa-3-azabicyclo[3.2.1]octane-7-carboxamide | 3-azadioxabicyclooctane derivative, 23
Type:
Small organic molecule
Emp. Form.:
C13H14N2O5
Mol. Mass.:
278.2607
SMILES:
ONC(=O)[C@@H]1O[C@H]2CN(Cc3ccccc3)C(=O)[C@@H]1O2
:
Substrate