Target
Macrophage metalloelastase
Ligand
BDBM29022
Substrate
BDBM10852
Meas. Tech.
Dissociation Constants (KD) Measurements
pH
7.2±n/a
Temperature
298.15±n/a K
Kd
3400000±n/a nM
Citation
 Mannino, CNievo, MMachetti, FPapakyriakou, ACalderone, VFragai, MGuarna, A Synthesis of bicyclic molecular scaffolds (BTAa): an investigation towards new selective MMP-12 inhibitors. Bioorg Med Chem 14:7392-403 (2006)  
Target
Name:
Macrophage metalloelastase
Synonyms:
HME MMP12_HUMAN Matrix metalloproteinase-12 (MMP 12) Matrix metalloproteinase-12 (MMP12) | Matrix metalloproteinases 12 (MMP-12)
Type:
Enzyme
Mol. Mass.:
54012.99
Organism:
Homo sapiens (Human)
Description:
P39900
Residue:
470
  
Inhibitor
Name:
BDBM29022
Synonyms:
ethyl 1-(hydroxycarbamoyl)piperidine-4-carboxylate | piperidine-4-carboxylic acid ethyl ester, 15
Type:
Small organic molecule
Emp. Form.:
C9H16N2O4
Mol. Mass.:
216.2343
SMILES:
CCOC(=O)C1CCN(CC1)C(=O)NO
:
Substrate