Target
Cathepsin S
Ligand
BDBM33986
Substrate
Cathepsin S Substrate Peptide
Meas. Tech.
Cathepsn S Inhibition Assay
pH
5±n/a
Temperature
296.15±n/a K
IC50
1500±n/a nM
Citation
 Ameriks, MKAxe, FUBembenek, SDEdwards, JPGu, YKarlsson, LRandal, MSun, SThurmond, RLZhu, J Pyrazole-based cathepsin S inhibitors with arylalkynes as P1 binding elements. Bioorg Med Chem Lett 19:6131-4 (2009)  
Target
Name:
Cathepsin S
Synonyms:
CATS_HUMAN Cathepsin S (Cat S) | cathepsin S preproprotein
Type:
Protein
Mol. Mass.:
37507.38
Organism:
Homo sapiens (Human)
Description:
P25774
Residue:
331
  
Inhibitor
Name:
BDBM33986
Synonyms:
arylalkyne pyrazole-based compound, 17
Type:
Small organic molecule
Emp. Form.:
C29H30ClF3N4O3S
Mol. Mass.:
607.087
SMILES:
CS(=O)(=O)N1CCc2c(C1)c(nn2CCCN1CCOCC1)-c1ccc(Cl)c(c1)C#Cc1cccc(c1)C(F)(F)F
:
Substrate
Name:
Cathepsin S Substrate Peptide
Synonyms:
Type:
Internally quenched FRET peptide
Mol. Mass.:
2951.18
Organism:
Description:
Residue:
27