Target
Serine/threonine-protein kinase mTOR
Ligand
BDBM35589
Substrate
Ribosomal protein S6 kinase (P70S6K)
Meas. Tech.
mTOR Kinase Assay
pH
7.4±n/a
Temperature
296.15±n/a K
IC50
0.32±0.06 nM
Citation
 Zask, AVerheijen, JCCurran, KKaplan, JRichard, DJNowak, PMalwitz, DJBrooijmans, NBard, JSvenson, KLucas, JToral-Barza, LZhang, WGHollander, IGibbons, JJAbraham, RTAyral-Kaloustian, SMansour, TSYu, K ATP-Competitive Inhibitors of the Mammalian Target of Rapamycin: Design and Synthesis of Highly Potent and Selective Pyrazolopyrimidines J Med Chem 52:5013-6 (2009)  
Target
Name:
Serine/threonine-protein kinase mTOR
Synonyms:
FK506-binding protein 12-rapamycin complex-associated protein 1 FRAP FRAP1 MTOR Mammalian Target of Rapamycin (mTOR) RAFT1 Rapamycin and FKBP12 target 1 Serine/threonine-protein kinase (mTOR) | mTORC2
Type:
Rapamycin target protein
Mol. Mass.:
288917.12
Organism:
Homo sapiens (Human)
Description:
P42345
Residue:
2549
  
Inhibitor
Name:
BDBM35589
Synonyms:
pyrazolo pyrimidine, 21
Type:
Small organic molecule
Emp. Form.:
C25H32N8O4
Mol. Mass.:
508.5728
SMILES:
CCNC(=O)Nc1ccc(cc1)-c1nc(N2CCOCC2)c2cnn(C3CCN(CC3)C(=O)OC)c2n1
:
Substrate
Name:
Ribosomal protein S6 kinase beta-1
Synonyms:
70 kDa ribosomal protein S6 kinase 1 70 kDa ribosomal protein kinase (p70S6K) Protein kinase 70S6K (T412E) RPS6KB1 Ribosomal protein S6 kinase I STK14A p70S6K1
Type:
Enzyme
Mol. Mass.:
59139.89
Organism:
Homo sapiens (Human)
Description:
His-tagged S6K1.
Residue:
525