Target
Caspase-3
Ligand
BDBM50004308
Substrate
Meas. Tech.
Procaspase-3 Activation Assay
pH
7.4±0
Temperature
310.15±0 K
EC50
>5.0e+4±n/a nM
Citation
 Putt, KSChen, GWPearson, JMSandhorst, JSHoagland, MSKwon, JTHwang, SKJin, HChurchwell, MICho, MHDoerge, DRHelferich, WGHergenrother, PJ Small-molecule activation of procaspase-3 to caspase-3 as a personalized anticancer strategy. Nat Chem Biol 2:543-50 (2006)  
Target
Name:
Caspase-3
Synonyms:
Apopain CASP3 CPP-32 Caspase 3 Caspase-3 subunit p17 SCA-1 Yama protein | caspase-3 preproprotein
Type:
Hydrolase; heterotetramer of two heterodimers
Mol. Mass.:
31607.55
Organism:
Homo sapiens (Human)
Description:
Residue:
277
  
Inhibitor
Name:
BDBM50004308
Synonyms:
1-Benzoylpiperazine 1-Benzyl-piperazine, 10 CHEMBL113600 | US10166229, Example 00033
Type:
Small organic molecule
Emp. Form.:
C11H16N2
Mol. Mass.:
176.2581
SMILES:
C(N1CCNCC1)c1ccccc1
: