Target
Dipeptidase 1
Ligand
BDBM36635
Substrate
Meas. Tech.
Dehydropeptidase I Assay
pH
7±0
Temperature
310.15±0 K
IC50
>5.00e+5±n/a nM
Citation
 Toney, JHFitzgerald, PMGrover-Sharma, NOlson, SHMay, WJSundelof, JGVanderwall, DECleary, KAGrant, SKWu, JKKozarich, JWPompliano, DLHammond, GG Antibiotic sensitization using biphenyl tetrazoles as potent inhibitors of Bacteroides fragilis metallo-beta-lactamase. Chem Biol 5:185-96 (1998)  
Target
Name:
Dipeptidase 1
Synonyms:
DPEP1 Dehydropeptidase-I Dipeptidase 1 Microsomal dipeptidase Renal dipeptidase | hRDP
Type:
Protein
Mol. Mass.:
45670.34
Organism:
Homo sapiens (Human)
Description:
P16444
Residue:
411
  
Inhibitor
Name:
BDBM36635
Synonyms:
L-808,509
Type:
Small organic molecule
Emp. Form.:
C21H16N6
Mol. Mass.:
352.3919
SMILES:
C(c1ccc(cc1)-c1ccccc1-c1nnn[nH]1)n1cnc2ccccc12
: