Target
Tyrosine-protein kinase BTK
Ligand
BDBM267501
Substrate
Meas. Tech.
Btk Enzyme Activity Assay A
pH
7.2±n/a
Temperature
298.15±n/a K
EC50
<10.00±n/a nM
Comments
extracted
Citation
Target
Name:
Tyrosine-protein kinase BTK
Synonyms:
AGMX1 Agammaglobulinaemia tyrosine kinase B cell progenitor kinase BPK BTK_HUMAN Tyrosine Kinase BTK Tyrosine-protein kinase BTK (BTK)
Type:
Enzyme
Mol. Mass.:
76289.95
Organism:
Homo sapiens (Human)
Description:
Q06187
Residue:
659
  
Inhibitor
Name:
BDBM267501
Synonyms:
4-(8-amino-3-(tetrahydro-2H-pyran-4-yl)imidazo[1,5-a]pyrazin-1-yl)-N-(thiazol-2-yl)benzamide | US9718828, Example, 30
Type:
Small organic molecule
Emp. Form.:
C26H26N6O2
Mol. Mass.:
454.5236
SMILES:
CCCc1ccnc(NC(=O)c2ccc(cc2)-c2nc([C@@H]3[C@H]4COC[C@@H]34)n3ccnc(N)c23)c1
: