Target
Glycine hydroxymethyltransferase
Ligand
BDBM50239677
Substrate
Meas. Tech.
ChEMBL_1666642 (CHEMBL4016438)
IC50
370±n/a nM
Citation
 Schwertz, GWitschel, MCRottmann, MBonnert, RLeartsakulpanich, UChitnumsub, PJaruwat, AIttarat, WSchäfer, AAponte, RACharman, SAWhite, KLKundu, ASadhukhan, SLloyd, MFreiberg, GMSrikumaran, MSiggel, MZwyssig, AChaiyen, PDiederich, F Antimalarial Inhibitors Targeting Serine Hydroxymethyltransferase (SHMT) with in Vivo Efficacy and Analysis of their Binding Mode Based on X-ray Cocrystal Structures. J Med Chem 60:4840-4860 (2017)  
Target
Name:
Glycine hydroxymethyltransferase
Synonyms:
2.1.2.1 | SHMT
Type:
PROTEIN
Mol. Mass.:
49787.58
Organism:
Plasmodium falciparum
Description:
ChEMBL_117520
Residue:
442
  
Inhibitor
Name:
BDBM50239677
Synonyms:
CHEMBL4073208
Type:
Small organic molecule
Emp. Form.:
C23H22N4O3S
Mol. Mass.:
434.511
SMILES:
COC(=O)c1ccc(s1)-c1cc(cc(c1)C1(C=C(N)Oc2n[nH]c(C)c12)C(C)C)C#N
: