Target
Platelet glycoprotein 4
Ligand
BDBM50370294
Substrate
Meas. Tech.
ChEMBL_1670776 (CHEMBL4020664)
IC50
1560±n/a nM
Citation
 Chignen Possi, KMulumba, MOmri, SGarcia-Ramos, YTahiri, HChemtob, SOng, HLubell, WD Influences of Histidine-1 and Azaphenylalanine-4 on the Affinity, Anti-inflammatory, and Antiangiogenic Activities of Azapeptide Cluster of Differentiation 36 Receptor Modulators. J Med Chem 60:9263-9274 (2017)  
Target
Name:
Platelet glycoprotein 4
Synonyms:
Adipocyte membrane protein CD_antigen=CD36 Fat Fatty acid transport protein GPIV PAS IV Platelet glycoprotein IV
Type:
PROTEIN
Mol. Mass.:
52740.95
Organism:
Rattus norvegicus
Description:
ChEMBL_858884
Residue:
472
  
Inhibitor
Name:
BDBM50370294
Synonyms:
Examorelin US9708370, Hexareline
Type:
Small organic molecule
Emp. Form.:
C47H58N12O6
Mol. Mass.:
887.0402
SMILES:
C[C@H](NC(=O)[C@@H](Cc1c(C)[nH]c2ccccc12)NC(=O)[C@@H](N)Cc1cnc[nH]1)C(=O)N[C@@H](Cc1c[nH]c2ccccc12)C(=O)N[C@H](Cc1ccccc1)C(=O)N[C@@H](CCCCN)C(N)=O
: