Target
Platelet glycoprotein 4
Ligand
BDBM50242212
Substrate
Meas. Tech.
ChEMBL_1670776 (CHEMBL4020664)
IC50
7510±n/a nM
Citation
 Chignen Possi, KMulumba, MOmri, SGarcia-Ramos, YTahiri, HChemtob, SOng, HLubell, WD Influences of Histidine-1 and Azaphenylalanine-4 on the Affinity, Anti-inflammatory, and Antiangiogenic Activities of Azapeptide Cluster of Differentiation 36 Receptor Modulators. J Med Chem 60:9263-9274 (2017)  
Target
Name:
Platelet glycoprotein 4
Synonyms:
Adipocyte membrane protein CD_antigen=CD36 Fat Fatty acid transport protein GPIV PAS IV Platelet glycoprotein IV
Type:
PROTEIN
Mol. Mass.:
52740.95
Organism:
Rattus norvegicus
Description:
ChEMBL_858884
Residue:
472
  
Inhibitor
Name:
BDBM50242212
Synonyms:
CHEMBL4085058
Type:
Small organic molecule
Emp. Form.:
C44H56N12O7
Mol. Mass.:
864.9916
SMILES:
COc1ccc(CN(NC(=O)[C@H](C)NC(=O)[C@@H](Cc2c[nH]c3ccccc23)NC(=O)[C@@H](N)Cc2cnc[nH]2)C(=O)N[C@H](Cc2ccccc2)C(=O)N[C@@H](CCCCN)C(N)=O)cc1
: