Target
Estrogen receptor
Ligand
BDBM50242218
Substrate
Meas. Tech.
ChEMBL_1670787 (CHEMBL4020675)
Kd
85±n/a nM
Citation
 Xie, MZhao, HLiu, QZhu, YYin, FLiang, YJiang, YWang, DHu, KQin, XWang, ZWu, YXu, NYe, XWang, TLi, Z Structural Basis of Inhibition of ER?-Coactivator Interaction by High-Affinity N-Terminus Isoaspartic Acid Tethered Helical Peptides. J Med Chem 60:8731-8740 (2017)  
Target
Name:
Estrogen receptor
Synonyms:
ER ESR ESR1_HUMAN Estrogen receptor Estrogen receptor (ER-alpha) Estrogen receptor alpha (ER) Nuclear receptor subfamily 3 group A member 1
Type:
Protein
Mol. Mass.:
66230.44
Organism:
Homo sapiens (Human)
Description:
P03372
Residue:
595
  
Inhibitor
Name:
BDBM50242218
Synonyms:
CHEMBL4086339
Type:
Small organic molecule
Emp. Form.:
C72H104N20O17S
Mol. Mass.:
1553.785
SMILES:
CC[C@H](C)[C@@H]1NC(=O)C[C@H](NC(=O)[C@H](CCCNC(N)=N)NCCC(=O)NC(=S)Nc2ccc3c(c2)C(=O)OC32c3ccc(O)cc3Oc3cc(O)ccc23)C(=O)NCC(NC(=O)[C@H](CC(C)C)NC1=O)C(=O)N[C@@H](CCCNC(N)=N)C(=O)N[C@@H](CC(C)C)C(=O)N[C@@H](CC(C)C)C(=O)N[C@@H](CCC(N)=O)C(N)=O
: