Target
Vitamin D3 receptor
Ligand
BDBM50242220
Substrate
Meas. Tech.
ChEMBL_1670790 (CHEMBL4020678)
Kd
142±n/a nM
Citation
 Xie, MZhao, HLiu, QZhu, YYin, FLiang, YJiang, YWang, DHu, KQin, XWang, ZWu, YXu, NYe, XWang, TLi, Z Structural Basis of Inhibition of ER?-Coactivator Interaction by High-Affinity N-Terminus Isoaspartic Acid Tethered Helical Peptides. J Med Chem 60:8731-8740 (2017)  
Target
Name:
Vitamin D3 receptor
Synonyms:
1,25-dihydroxyvitamin D3 receptor Nuclear receptor subfamily 1 group I member 1 VDR | VDR_HUMAN
Type:
Protein
Mol. Mass.:
48288.72
Organism:
Homo sapiens (Human)
Description:
P11473
Residue:
427
  
Inhibitor
Name:
BDBM50242220
Synonyms:
CHEMBL4066573
Type:
Small organic molecule
Emp. Form.:
C77H109N21O16S
Mol. Mass.:
1616.885
SMILES:
CC[C@H](C)[C@H](NC(=O)[C@H](CCCCN)NC(=O)[C@H](Cc1cnc[nH]1)NC(=O)CCNC(=S)Nc1ccc2c(c1)C(=O)OC21c2ccc(O)cc2Oc2cc(O)ccc12)C(=O)N[C@@H](CC(C)C)C(=O)N[C@@H](Cc1cnc[nH]1)C(=O)N[C@@H](CCCNC(N)=N)C(=O)N[C@@H](CC(C)C)C(=O)N[C@@H](CC(C)C)C(=O)N[C@@H](CCC(N)=O)C(N)=O
: