Target
Vitamin D3 receptor
Ligand
BDBM50242218
Substrate
Meas. Tech.
ChEMBL_1670790 (CHEMBL4020678)
Kd
197±n/a nM
Citation
 Xie, MZhao, HLiu, QZhu, YYin, FLiang, YJiang, YWang, DHu, KQin, XWang, ZWu, YXu, NYe, XWang, TLi, Z Structural Basis of Inhibition of ER?-Coactivator Interaction by High-Affinity N-Terminus Isoaspartic Acid Tethered Helical Peptides. J Med Chem 60:8731-8740 (2017)  
Target
Name:
Vitamin D3 receptor
Synonyms:
1,25-dihydroxyvitamin D3 receptor Nuclear receptor subfamily 1 group I member 1 VDR | VDR_HUMAN
Type:
Protein
Mol. Mass.:
48288.72
Organism:
Homo sapiens (Human)
Description:
P11473
Residue:
427
  
Inhibitor
Name:
BDBM50242218
Synonyms:
CHEMBL4086339
Type:
Small organic molecule
Emp. Form.:
C72H104N20O17S
Mol. Mass.:
1553.785
SMILES:
CC[C@H](C)[C@@H]1NC(=O)C[C@H](NC(=O)[C@H](CCCNC(N)=N)NCCC(=O)NC(=S)Nc2ccc3c(c2)C(=O)OC32c3ccc(O)cc3Oc3cc(O)ccc23)C(=O)NCC(NC(=O)[C@H](CC(C)C)NC1=O)C(=O)N[C@@H](CCCNC(N)=N)C(=O)N[C@@H](CC(C)C)C(=O)N[C@@H](CC(C)C)C(=O)N[C@@H](CCC(N)=O)C(N)=O
: