Target
Progesterone receptor
Ligand
BDBM50242219
Substrate
Meas. Tech.
ChEMBL_1670789 (CHEMBL4020677)
Kd
248±n/a nM
Citation
 Xie, MZhao, HLiu, QZhu, YYin, FLiang, YJiang, YWang, DHu, KQin, XWang, ZWu, YXu, NYe, XWang, TLi, Z Structural Basis of Inhibition of ER?-Coactivator Interaction by High-Affinity N-Terminus Isoaspartic Acid Tethered Helical Peptides. J Med Chem 60:8731-8740 (2017)  
Target
Name:
Progesterone receptor
Synonyms:
NR3C3 PGR PRGR_HUMAN | progesterone
Type:
Protein
Mol. Mass.:
98979.52
Organism:
Homo sapiens (Human)
Description:
P06401
Residue:
933
  
Inhibitor
Name:
BDBM50242219
Synonyms:
CHEMBL4067602
Type:
Small organic molecule
Emp. Form.:
C75H110N20O17S
Mol. Mass.:
1595.865
SMILES:
CC[C@H](C)[C@@H]1NC(=O)C[C@H](NC(=O)[C@H](CCCNC(N)=N)NC(=O)CCNC(=S)Nc2ccc3c(c2)C(=O)OC32c3ccc(O)cc3Oc3cc(O)ccc23)C(=O)NCC(NC(=O)C(CC(C)(C)C)NC1=O)C(=O)N[C@@H](CCCNC(N)=N)C(=O)NC(CC(C)(C)C)C(=O)NC(CC(C)(C)C)C(=O)N[C@@H](CCC(N)=O)C(N)=O
: