Target
Cholinesterase
Ligand
BDBM50244276
Substrate
Meas. Tech.
ChEMBL_1673544 (CHEMBL4023573)
IC50
9700±n/a nM
Citation
 Dolles, DHoffmann, MGunesch, SMarinelli, OMöller, JSantoni, GChatonnet, ALohse, MJWittmann, HJStrasser, ANabissi, MMaurice, TDecker, M Structure-Activity Relationships and Computational Investigations into the Development of Potent and Balanced Dual-Acting Butyrylcholinesterase Inhibitors and Human Cannabinoid Receptor 2 Ligands with Pro-Cognitive in Vivo Profiles. J Med Chem 61:1646-1663 (2018)  
Target
Name:
Cholinesterase
Synonyms:
BCHE CHLE_HORSE | Cholinesterase
Type:
Enzyme
Mol. Mass.:
65643.35
Organism:
Equus caballus (Horse)
Description:
P81908
Residue:
574
  
Inhibitor
Name:
BDBM50244276
Synonyms:
2-(4-ethoxybenzyl)-N,N-diethyl-1-isopentyl-1H-benzo[d]imidazole-5-carboxamide | CHEMBL471980
Type:
Small organic molecule
Emp. Form.:
C26H35N3O2
Mol. Mass.:
421.575
SMILES:
CCOc1ccc(Cc2nc3cc(ccc3n2CCC(C)C)C(=O)N(CC)CC)cc1
: