Target
Renin
Ligand
BDBM50006158
Substrate
Meas. Tech.
ChEBML_195793
pH
7.4±n/a
IC50
1000±n/a nM
Comments
extracted
Citation
 Baker, WRFung, AKKleinert, HDStein, HHPlattner, JJArmiger, YLCondon, SLCohen, JEgan, DABarlow, JL Nonpeptide renin inhibitors employing a novel 3-aza(or oxa)-2,4-dialkyl glutaric acid moiety as a P2/P3 amide bond replacement. J Med Chem 35:1722-34 (1992)  
Target
Name:
Renin
Synonyms:
Angiotensinogenase RENI_HUMAN
Type:
Enzyme
Mol. Mass.:
45058.99
Organism:
Homo sapiens (Human)
Description:
Residue:
406
  
Inhibitor
Name:
BDBM50006158
Synonyms:
2-[1-(1-Cyclohexylmethyl-2,3-dihydroxy-5-methyl-hexylcarbamoyl)-3-methyl-butylamino]-4-phenyl-butyric acid tert-butyl ester | CHEMBL49539
Type:
Small organic molecule
Emp. Form.:
C34H58N2O5
Mol. Mass.:
574.8347
SMILES:
CC(C)C[C@H](O)[C@H](O)[C@H](CC1CCCCC1)NC(=O)C(CC(C)C)N[C@@H](CCc1ccccc1)C(=O)OC(C)(C)C
: