Target
Renin
Ligand
BDBM50006179
Substrate
Meas. Tech.
ChEBML_195919
pH
6±n/a
IC50
2±n/a nM
Comments
extracted
Citation
 Boyd, SAFung, AKBaker, WRMantei, RAArmiger, YLStein, HHCohen, JEgan, DABarlow, JLKlinghofer, V C-terminal modifications of nonpeptide renin inhibitors: improved oral bioavailability via modification of physicochemical properties. J Med Chem 35:1735-46 (1992)  
Target
Name:
Renin
Synonyms:
Angiotensinogenase RENI_HUMAN
Type:
Enzyme
Mol. Mass.:
45058.99
Organism:
Homo sapiens (Human)
Description:
Residue:
406
  
Inhibitor
Name:
BDBM50006179
Synonyms:
(2S,4S,5S)-5-{(S)-2-[(S)-1-Benzyl-2-(4-methoxymethoxy-piperidin-1-yl)-2-oxo-ethylamino]-hexanoylamino}-6-cyclohexyl-4-hydroxy-2-isopropyl-hexanoic acid (3-imidazol-1-yl-propyl)-amide CHEMBL49172
Type:
Small organic molecule
Emp. Form.:
C43H70N6O6
Mol. Mass.:
767.0525
SMILES:
CCCC[C@H](N[C@@H](Cc1ccccc1)C(=O)N1CCC(CC1)OCOC)C(=O)N[C@@H](CC1CCCCC1)[C@@H](O)C[C@@H](C(C)C)C(=O)NCCCn1ccnc1
: