Target
Renin
Ligand
BDBM50006209
Substrate
Meas. Tech.
ChEBML_195919
pH
6±n/a
IC50
110±n/a nM
Comments
extracted
Citation
 Boyd, SAFung, AKBaker, WRMantei, RAArmiger, YLStein, HHCohen, JEgan, DABarlow, JLKlinghofer, V C-terminal modifications of nonpeptide renin inhibitors: improved oral bioavailability via modification of physicochemical properties. J Med Chem 35:1735-46 (1992)  
Target
Name:
Renin
Synonyms:
Angiotensinogenase RENI_HUMAN
Type:
Enzyme
Mol. Mass.:
45058.99
Organism:
Homo sapiens (Human)
Description:
Residue:
406
  
Inhibitor
Name:
BDBM50006209
Synonyms:
2-[1-Benzyl-2-(4-methoxymethoxy-piperidin-1-yl)-2-oxo-ethoxy]-hexanoic acid (4-amino-1-cyclohexylmethyl-2-hydroxy-5-methyl-hexyl)-amide | CHEMBL46240
Type:
Small organic molecule
Emp. Form.:
C36H61N3O6
Mol. Mass.:
631.886
SMILES:
CCCC[C@H](O[C@@H](Cc1ccccc1)C(=O)N1CCC(CC1)OCOC)C(=O)N[C@@H](CC1CCCCC1)[C@@H](O)C[C@H](N)C(C)C
: