Target
P2X purinoceptor 7
Ligand
BDBM254305
Substrate
Meas. Tech.
ChEBML_1683149
IC50
4.1±n/a nM
Citation
 Chrovian, CCSoyode-Johnson, APeterson, AAGelin, CFDeng, XDvorak, CACarruthers, NILord, BFraser, IAluisio, LCoe, KJScott, BKoudriakova, TSchoetens, FSepassi, KGallacher, DJBhattacharya, ALetavic, MA A Dipolar Cycloaddition Reaction To Access 6-Methyl-4,5,6,7-tetrahydro-1H-[1,2,3]triazolo[4,5-c]pyridines Enables the Discovery Synthesis and Preclinical Profiling of a P2X7 Antagonist Clinical Candidate. J Med Chem 61:207-223 (2018)  
Target
Name:
P2X purinoceptor 7
Synonyms:
ATP receptor P2X purinoceptor 7 P2X purinoceptor 7 (P2X7) P2X7 rat P2rx7 | Purinergic receptor
Type:
Protein
Mol. Mass.:
68403.50
Organism:
Rattus norvegicus (Rat)
Description:
Q64663
Residue:
595
  
Inhibitor
Name:
BDBM254305
Synonyms:
US10112937, Example 202 US10703749, Example 202 | US9464084, 202
Type:
Small organic molecule
Emp. Form.:
C18H13ClF4N6O
Mol. Mass.:
440.782
SMILES:
C[C@H]1Cc2c(CN1C(=O)c1cccc(c1Cl)C(F)(F)F)nnn2-c1ncc(F)cn1
: