Target
Inward rectifier potassium channel 2
Ligand
BDBM50257064
Substrate
Meas. Tech.
ChEBML_1688715
IC50
>100000±n/a nM
Citation
 Felts, ASRodriguez, ALBlobaum, ALMorrison, RDBates, BSThompson Gray, ARook, JMTantawy, MNByers, FWChang, SVenable, DFLuscombe, VBTamagnan, GDNiswender, CMDaniels, JSJones, CKConn, PJLindsley, CWEmmitte, KA Discovery of N-(5-Fluoropyridin-2-yl)-6-methyl-4-(pyrimidin-5-yloxy)picolinamide (VU0424238): A Novel Negative Allosteric Modulator of Metabotropic Glutamate Receptor Subtype 5 Selected for Clinical Evaluation. J Med Chem 60:5072-5085 (2017)  
Target
Name:
Inward rectifier potassium channel 2
Synonyms:
Cardiac inward rectifier potassium channel IRK1 KCNJ2 Potassium channel, inwardly rectifying subfamily J member 2 | hIRK1
Type:
PROTEIN
Mol. Mass.:
48281.20
Organism:
Homo sapiens (Human)
Description:
ChEMBL_1515520
Residue:
427
  
Inhibitor
Name:
BDBM50257064
Synonyms:
CHEMBL2386850
Type:
Small organic molecule
Emp. Form.:
C16H12FN5O2
Mol. Mass.:
325.2972
SMILES:
Cc1cc(Oc2cncnc2)cc(n1)C(=O)Nc1ccc(F)cn1
: