Target
Beta-adrenergic receptor kinase 1
Ligand
BDBM50257425
Substrate
Meas. Tech.
ChEBML_1689808
IC50
12±n/a nM
Citation
 Okawa, TAramaki, YYamamoto, MKobayashi, TFukumoto, SToyoda, YHenta, THata, AIkeda, SKaneko, MHoffman, IDSang, BCZou, HKawamoto, T Design, Synthesis, and Evaluation of the Highly Selective and Potent G-Protein-Coupled Receptor Kinase 2 (GRK2) Inhibitor for the Potential Treatment of Heart Failure. J Med Chem 60:6942-6990 (2017)  
Target
Name:
Beta-adrenergic receptor kinase 1
Synonyms:
ADRBK1 BARK Beta-ARK-1 G-protein coupled receptor kinase 2 GRK2
Type:
Enzyme
Mol. Mass.:
79581.30
Organism:
Homo sapiens (Human)
Description:
P25098
Residue:
689
  
Inhibitor
Name:
BDBM50257425
Synonyms:
CHEMBL4060973
Type:
Small organic molecule
Emp. Form.:
C23H22N6O2
Mol. Mass.:
414.4598
SMILES:
COc1cccc(CNC(=O)c2cccc(NCc3nnc([nH]3)-c3ccncc3)c2)c1
: