Target
Beta-adrenergic receptor kinase 1
Ligand
BDBM50257429
Substrate
Meas. Tech.
ChEBML_1689808
IC50
12±n/a nM
Citation
 Okawa, TAramaki, YYamamoto, MKobayashi, TFukumoto, SToyoda, YHenta, THata, AIkeda, SKaneko, MHoffman, IDSang, BCZou, HKawamoto, T Design, Synthesis, and Evaluation of the Highly Selective and Potent G-Protein-Coupled Receptor Kinase 2 (GRK2) Inhibitor for the Potential Treatment of Heart Failure. J Med Chem 60:6942-6990 (2017)  
Target
Name:
Beta-adrenergic receptor kinase 1
Synonyms:
ADRBK1 BARK Beta-ARK-1 G-protein coupled receptor kinase 2 GRK2
Type:
Enzyme
Mol. Mass.:
79581.30
Organism:
Homo sapiens (Human)
Description:
P25098
Residue:
689
  
Inhibitor
Name:
BDBM50257429
Synonyms:
CHEMBL4061438
Type:
Small organic molecule
Emp. Form.:
C23H21ClN6O
Mol. Mass.:
432.905
SMILES:
Cn1c(CNc2cccc(c2)C(=O)NCc2ccccc2Cl)nnc1-c1ccncc1
: