Target
Inward rectifier potassium channel 2
Ligand
BDBM50258216
Substrate
Meas. Tech.
ChEBML_1690315
IC50
>30000±n/a nM
Citation
 Martinez Botella, GSalituro, FGHarrison, BLBeresis, RTBai, ZBlanco, MJBelfort, GMDai, JLoya, CMAckley, MAAlthaus, ALGrossman, SJHoffmann, EDoherty, JJRobichaud, AJ Neuroactive Steroids. 2. 3?-Hydroxy-3?-methyl-21-(4-cyano-1H-pyrazol-1'-yl)-19-nor-5?-pregnan-20-one (SAGE-217): A Clinical Next Generation Neuroactive Steroid Positive Allosteric Modulator of the (?-Aminobutyric Acid) J Med Chem 60:7810-7819 (2017)  
Target
Name:
Inward rectifier potassium channel 2
Synonyms:
Cardiac inward rectifier potassium channel IRK1 KCNJ2 Potassium channel, inwardly rectifying subfamily J member 2 | hIRK1
Type:
PROTEIN
Mol. Mass.:
48281.20
Organism:
Homo sapiens (Human)
Description:
ChEMBL_1515520
Residue:
427
  
Inhibitor
Name:
BDBM50258216
Synonyms:
CHEMBL4105630
Type:
Small organic molecule
Emp. Form.:
C25H35N3O2
Mol. Mass.:
409.5643
SMILES:
[H][C@@]12CC[C@H](C(=O)Cn3cc(cn3)C#N)[C@@]1(C)CC[C@@]1([H])[C@@]2([H])CC[C@]2([H])C[C@](C)(O)CC[C@]12[H]
: