Target
Orexin/Hypocretin receptor type 1
Ligand
BDBM50260985
Substrate
Meas. Tech.
ChEBML_1695402
IC50
1.6±n/a nM
Citation
 Futamura, ANozawa, DAraki, YTamura, YTokura, SKawamoto, HTokumaru, YKakihara, SAoki, TOhtake, N Identification of highly selective and potent orexin receptor 1 antagonists derived from a dual orexin receptor 1/2 antagonist based on the structural framework of pyrazoylethylbenzamide. Bioorg Med Chem 25:5203-5215 (2017)  
Target
Name:
Orexin/Hypocretin receptor type 1
Synonyms:
HCRTR1 OX1R_HUMAN Orexin receptor type 1 (OR 1) Orexin receptor type 1 (OX1) Orexin receptor type 1 (OxR1) | Ox1r
Type:
Protein
Mol. Mass.:
47554.50
Organism:
Homo sapiens (Human)
Description:
O43613
Residue:
425
  
Inhibitor
Name:
BDBM50260985
Synonyms:
CHEMBL4100428
Type:
Small organic molecule
Emp. Form.:
C23H24FN7O
Mol. Mass.:
433.4814
SMILES:
CCN([C@@H](C)Cn1ccc(n1)-c1ccc(F)cn1)C(=O)c1cc(C)ccc1-n1nccn1
: