Target
cAMP-specific 3',5'-cyclic phosphodiesterase 4B
Ligand
BDBM50261621
Substrate
Meas. Tech.
ChEBML_1696172
IC50
22360±n/a nM
Citation
 Song, GZhu, XLi, JHu, DZhao, DLiao, YLin, JZhang, LHCui, ZN Rational design of conformationally constrained oxazolidinone-fused 1,2,3,4-tetrahydroisoquinoline derivatives as potential PDE4 inhibitors. Bioorg Med Chem 25:5709-5717 (2017)  
Target
Name:
cAMP-specific 3',5'-cyclic phosphodiesterase 4B
Synonyms:
3',5'-cyclic phosphodiesterase Isoform PDE4B1 PDE4B PDE4B_HUMAN Phosphodiesterase 4B (PDE4B) Phosphodiesterase Type 4 (PDE4B)
Type:
Protein
Mol. Mass.:
83318.87
Organism:
Homo sapiens (Human)
Description:
Q07343
Residue:
736
  
Inhibitor
Name:
BDBM50261621
Synonyms:
CHEMBL4088267
Type:
Small organic molecule
Emp. Form.:
C15H19NO4
Mol. Mass.:
277.3157
SMILES:
CCCOc1cc2CN3C(COC3=O)Cc2cc1OC
: